Target
Lipoxygenase
Ligand
BDBM111812
Substrate
Meas. Tech.
Lipo-oxygenase activity assay
pH
7±n/a
Temperature
298.15±n/a K
IC50
9.507e+4± 4.24e+3 nM
Comments
extracted
Citation
 Ahmad, WKumolosasi, EJantan, IBukhari, SNJasamai, M Effects of novel diarylpentanoid analogues of curcumin on secretory phospholipase A2 , cyclooxygenases, lipo-oxygenase, and microsomal prostaglandin E synthase-1. Chem Biol Drug Des 83:670-81 (2014)  
Target
Name:
Lipoxygenase
Synonyms:
Lipoxygenase (LOX)
Type:
Protein
Mol. Mass.:
96302.37
Organism:
Glycine max (Soybean)
Description:
Residue:
859
  
Inhibitor
Name:
BDBM111812
Synonyms:
(1E,4E)‐1,5‐bis[4‐(diethylamino)phenyl]penta‐1,4‐ dien‐3‐one (11)
Type:
Small organic molecule
Emp. Form.:
C25H32N2O
Mol. Mass.:
376.5344
SMILES:
CCN(CC)c1ccc(\C=C\C(=O)\C=C\c2ccc(cc2)N(CC)CC)cc1
: