Target
Lipoxygenase
Ligand
BDBM111813
Substrate
Meas. Tech.
Lipo-oxygenase activity assay
pH
7±n/a
Temperature
298.15±n/a K
IC50
4.113e+4± 4.3e+2 nM
Comments
extracted
Citation
 Ahmad, WKumolosasi, EJantan, IBukhari, SNJasamai, M Effects of novel diarylpentanoid analogues of curcumin on secretory phospholipase A2 , cyclooxygenases, lipo-oxygenase, and microsomal prostaglandin E synthase-1. Chem Biol Drug Des 83:670-81 (2014)  
Target
Name:
Lipoxygenase
Synonyms:
Lipoxygenase (LOX)
Type:
Protein
Mol. Mass.:
96302.37
Organism:
Glycine max (Soybean)
Description:
Residue:
859
  
Inhibitor
Name:
BDBM111813
Synonyms:
(1E,4E)-1,5-Bis[2-methyl-4(N-ethyl-Nethylacetonitrile) aniline]-1,4-pentadiene-3-one (12)
Type:
Small organic molecule
Emp. Form.:
C31H38N4O
Mol. Mass.:
482.6596
SMILES:
CCN(CC)C(C#N)c1ccc(\C=C\C(=O)\C=C\c2ccc(cc2C)C(C#N)N(CC)CC)c(C)c1
: