Target
Lipoxygenase
Ligand
BDBM111817
Substrate
Meas. Tech.
Lipo-oxygenase activity assay
pH
7±n/a
Temperature
298.15±n/a K
IC50
5.676e+4± 7.4e+2 nM
Comments
extracted
Citation
 Ahmad, WKumolosasi, EJantan, IBukhari, SNJasamai, M Effects of novel diarylpentanoid analogues of curcumin on secretory phospholipase A2 , cyclooxygenases, lipo-oxygenase, and microsomal prostaglandin E synthase-1. Chem Biol Drug Des 83:670-81 (2014)  
Target
Name:
Lipoxygenase
Synonyms:
Lipoxygenase (LOX)
Type:
Protein
Mol. Mass.:
96302.37
Organism:
Glycine max (Soybean)
Description:
Residue:
859
  
Inhibitor
Name:
BDBM111817
Synonyms:
2,5-Bis(4-diethylaminobenzylidene)cyclopentanone (17)
Type:
Small organic molecule
Emp. Form.:
C27H34N2O
Mol. Mass.:
402.5717
SMILES:
CCN(CC)c1ccc(\C=C2/CC\C(=C/c3ccc(cc3)N(CC)CC)C2=O)cc1
: