Target
Alpha-glucosidase MAL12
Ligand
BDBM112646
Substrate
Meas. Tech.
Glucosidase assay
pH
6.8±n/a
Temperature
310.15±n/a K
IC50
1.1221e+5± 9.7e+2 nM
Comments
extracted
Citation
 Yar, MBajda, MShahzadi, LShahzad, SAAhmed, MAshraf, MAlam, UKhan, IUKhan, AF Novel synthesis of dihydropyrimidines for a-glucosidase inhibition to treat type 2 diabetes: in vitro biological evaluation and in silico docking. Bioorg Chem 54:96-104 (2014)  
Target
Name:
Alpha-glucosidase MAL12
Synonyms:
α-Glucosidase MAL12_YEAST Maltase | alpha-Glucosidase (α-Glucosidase)
Type:
Protein
Mol. Mass.:
68084.32
Organism:
Saccharomyces cerevisiae
Description:
P53341
Residue:
584
  
Inhibitor
Name:
BDBM112646
Synonyms:
Ethyl 6-methyl-4-(4-methylphenyl)-2-oxo-1,2,3,4- tetrahydropyrimidine-5-carboxylate (4f)
Type:
Small organic molecule
Emp. Form.:
C15H18N2O3
Mol. Mass.:
274.315
SMILES:
CCOC(=O)C1C(NC(=O)N=C1C)c1ccc(C)cc1
: