Target
Acetyl-CoA carboxylase 2
Ligand
BDBM112954
Substrate
Meas. Tech.
Spectrophotometric 384 Well Assay
IC50
3050±n/a nM
Citation
 Fleck, MNosse, BRoth, GJ Azetidine derivatives, pharmaceutical compositions and uses thereof US Patent  US8623860 Publication Date 1/7/2014 
Target
Name:
Acetyl-CoA carboxylase 2
Synonyms:
ACACB ACC-beta ACCB Acetyl-CoA carboxylase 2 Acetyl-CoA carboxylase 2 (ACC2)
Type:
Protein
Mol. Mass.:
276535.21
Organism:
Homo sapiens (Human)
Description:
O00763
Residue:
2458
  
Inhibitor
Name:
BDBM112954
Synonyms:
US8623860, 3.18
Type:
Small organic molecule
Emp. Form.:
C26H31N3O2
Mol. Mass.:
417.5432
SMILES:
CC(Cc1ccc(cc1)C1CN(C1)c1ccc(OCC2CC2)cc1)NC(=O)CCC#N
: