Target
Melanin-concentrating hormone receptor 1
Ligand
BDBM113664
Substrate
Meas. Tech.
Binding Assay
pH
7.4±n/a
Temperature
298.15±n/a K
Ki
8.2±n/a nM
Comments
extracted
Citation
 Guzzo, PRSurman, MDGrabowski, Jr., JFFreeman, EE Azinone-substituted azepino[b]indole and pyrido-pyrrolo-azepine MCH-1 antagonists, methods of making, and use thereof US Patent  US8637501 Publication Date 1/28/2014 
Target
Name:
Melanin-concentrating hormone receptor 1
Synonyms:
G-protein coupled receptor 24 MCH receptor 1 MCH-R1 MCHR-1 MCHR1_HUMAN Melanin-Concentrating Hormone Receptor 1 (MCH1R) Melanin-concentrating hormone receptor 1 (MCH-1) Melanin-concentrating hormone receptor 1 (MCHR-1) SLC-1 Somatostatin receptor-like protein
Type:
G Protein-Coupled Receptor (GPCR)
Mol. Mass.:
45976.27
Organism:
Homo sapiens (Human)
Description:
Membranes from CHO-K1 cells stably expressing human MCH1R were used in assays.
Residue:
422
  
Inhibitor
Name:
BDBM113664
Synonyms:
US8637501, 68
Type:
Small organic molecule
Emp. Form.:
C25H23ClFN3O2
Mol. Mass.:
451.92
SMILES:
Cn1c2CCCNCc2c2ccc(cc12)-n1ccc(OCc2ccc(Cl)cc2F)cc1=O
: