Target
Disintegrin and metalloproteinase domain-containing protein 17
Ligand
BDBM54807
Substrate
Meas. Tech.
Counterscreen for exosite inhibitors of ADAM10: QFRET-based biochemical high throughput dose response assay to identify inhibitors of ADAM17
IC50
69509±n/a nM
Citation
 PubChem, PC Counterscreen for exosite inhibitors of ADAM10: QFRET-based biochemical high throughput dose response assay to identify inhibitors of ADAM17 PubChem Bioassay (2014)[AID] 
Target
Name:
Disintegrin and metalloproteinase domain-containing protein 17
Synonyms:
ADA17_HUMAN CSVP Disintegrin and metalloproteinase domain-containing protein 17 (ADAM17) TNF-alpha convertase TNF-alpha-converting enzyme (TACE) Tumor necrosis factor-α converting enzyme (TACE)
Type:
Enzyme
Mol. Mass.:
93007.89
Organism:
Homo sapiens (Human)
Description:
Residue:
824
  
Inhibitor
Name:
BDBM54807
Synonyms:
4-(2,5-dimethoxyphenyl)-N-[(Z)-3-indolylidenemethyl]-2-(2-methoxyethylimino)-3-thiazolamine MLS000375345 [4-(2,5-dimethoxyphenyl)-2-(2-methoxyethylimino)-4-thiazolin-3-yl]-[(Z)-indol-3-ylidenemethyl]amine | cid_6508436
Type:
Small organic molecule
Emp. Form.:
C23H24N4O3S
Mol. Mass.:
436.527
SMILES:
COCCN=c1scc(-c2cc(OC)ccc2OC)n1N=Cc1c[nH]c2ccccc12
: