Target
Disintegrin and metalloproteinase domain-containing protein 10
Ligand
BDBM54807
Substrate
Meas. Tech.
QFRET-based biochemical high throughput dose response assay to identify exosite inhibitors of ADAM10.
IC50
69509±n/a nM
Citation
 PubChem, PC QFRET-based biochemical high throughput dose response assay to identify exosite inhibitors of ADAM10. PubChem Bioassay (2014)[AID] 
Target
Name:
Disintegrin and metalloproteinase domain-containing protein 10
Synonyms:
ADA10_HUMAN Disintegrin and metalloproteinase domain-containing protein 10 (ADAM10) MADM
Type:
Enzyme
Mol. Mass.:
84160.93
Organism:
Homo sapiens (Human)
Description:
O14672
Residue:
748
  
Inhibitor
Name:
BDBM54807
Synonyms:
4-(2,5-dimethoxyphenyl)-N-[(Z)-3-indolylidenemethyl]-2-(2-methoxyethylimino)-3-thiazolamine MLS000375345 [4-(2,5-dimethoxyphenyl)-2-(2-methoxyethylimino)-4-thiazolin-3-yl]-[(Z)-indol-3-ylidenemethyl]amine | cid_6508436
Type:
Small organic molecule
Emp. Form.:
C23H24N4O3S
Mol. Mass.:
436.527
SMILES:
COCCN=c1scc(-c2cc(OC)ccc2OC)n1N=Cc1c[nH]c2ccccc12
: