Target
Disintegrin and metalloproteinase domain-containing protein 10
Ligand
BDBM114110
Substrate
Meas. Tech.
Counterscreen for exosite inhibitors of ADAM17: Fluorescence resonance energy transfer (FRET)-based biochemical high throughput dose response assay to identify inhibitors of ADAM10
IC50
10567±n/a nM
Citation
 PubChem, PC Counterscreen for exosite inhibitors of ADAM17: Fluorescence resonance energy transfer (FRET)-based biochemical high throughput dose response assay to identify inhibitors of ADAM10 PubChem Bioassay (2014)[AID] 
Target
Name:
Disintegrin and metalloproteinase domain-containing protein 10
Synonyms:
ADA10_HUMAN Disintegrin and metalloproteinase domain-containing protein 10 (ADAM10) MADM
Type:
Enzyme
Mol. Mass.:
84160.93
Organism:
Homo sapiens (Human)
Description:
O14672
Residue:
748
  
Inhibitor
Name:
BDBM114110
Synonyms:
3-methyl-5-[[1-oxo-2-(7,7,9-trimethyl-2,4-dioxo-1,3-diazaspiro[4.5]decan-3-yl)ethyl]amino]-2-thiophenecarboxylic acid ethyl ester MLS001157035 cid_24982874 ethyl 3-methyl-5-[[2-(7,7,9-trimethyl-2,4-dioxo-1,3-diazaspiro[4.5]decan-3-yl)acetyl]amino]thiophene-2-carboxylate
Type:
Small organic molecule
Emp. Form.:
C21H29N3O5S
Mol. Mass.:
435.537
SMILES:
CCOC(=O)c1sc(NC(=O)CN2C(=O)NC3(CC(C)CC(C)(C)C3)C2=O)cc1C
: