Target
Disintegrin and metalloproteinase domain-containing protein 10
Ligand
BDBM114162
Substrate
Meas. Tech.
Counterscreen for exosite inhibitors of ADAM17: Fluorescence resonance energy transfer (FRET)-based biochemical high throughput dose response assay to identify inhibitors of ADAM10
IC50
16038±n/a nM
Citation
 PubChem, PC Counterscreen for exosite inhibitors of ADAM17: Fluorescence resonance energy transfer (FRET)-based biochemical high throughput dose response assay to identify inhibitors of ADAM10 PubChem Bioassay (2014)[AID] 
Target
Name:
Disintegrin and metalloproteinase domain-containing protein 10
Synonyms:
ADA10_HUMAN Disintegrin and metalloproteinase domain-containing protein 10 (ADAM10) MADM
Type:
Enzyme
Mol. Mass.:
84160.93
Organism:
Homo sapiens (Human)
Description:
O14672
Residue:
748
  
Inhibitor
Name:
BDBM114162
Synonyms:
3-[[(E)-cinnamyl]thio]-4-(2-furfuryl)-5-[(4-methylphenoxy)methyl]-1,2,4-triazole 4-(furan-2-ylmethyl)-3-[(4-methylphenoxy)methyl]-5-[(E)-3-phenylprop-2-enyl]sulfanyl-1,2,4-triazole SMR001835918 | cid_5961704
Type:
Small organic molecule
Emp. Form.:
C24H23N3O2S
Mol. Mass.:
417.523
SMILES:
Cc1ccc(OCc2nnc(SC\C=C\c3ccccc3)n2Cc2ccco2)cc1
: