Target
Disintegrin and metalloproteinase domain-containing protein 17
Ligand
BDBM37275
Substrate
Meas. Tech.
QFRET-based biochemical high throughput dose response assay to identify exosite inhibitors of ADAM17
IC50
69500±n/a nM
Citation
 PubChem, PC QFRET-based biochemical high throughput dose response assay to identify exosite inhibitors of ADAM17 PubChem Bioassay (2014)[AID] 
Target
Name:
Disintegrin and metalloproteinase domain-containing protein 17
Synonyms:
ADA17_HUMAN CSVP Disintegrin and metalloproteinase domain-containing protein 17 (ADAM17) TNF-alpha convertase TNF-alpha-converting enzyme (TACE) Tumor necrosis factor-α converting enzyme (TACE)
Type:
Enzyme
Mol. Mass.:
93007.89
Organism:
Homo sapiens (Human)
Description:
Residue:
824
  
Inhibitor
Name:
BDBM37275
Synonyms:
4-[3-(2-methylphenyl)-2H-1,2,4-oxadiazol-5-ylidene]-1-cyclohexa-2,5-dienone 4-[3-(o-tolyl)-2H-1,2,4-oxadiazol-5-ylidene]cyclohexa-2,5-dien-1-one SMR000108415 | cid_5407960
Type:
Small organic molecule
Emp. Form.:
C15H12N2O2
Mol. Mass.:
252.268
SMILES:
Cc1ccccc1-c1noc(n1)-c1ccc(O)cc1
: