Target
Disintegrin and metalloproteinase domain-containing protein 17
Ligand
BDBM114162
Substrate
Meas. Tech.
QFRET-based biochemical high throughput dose response assay to identify exosite inhibitors of ADAM17
IC50
69562±n/a nM
Citation
 PubChem, PC QFRET-based biochemical high throughput dose response assay to identify exosite inhibitors of ADAM17 PubChem Bioassay (2014)[AID] 
Target
Name:
Disintegrin and metalloproteinase domain-containing protein 17
Synonyms:
ADA17_HUMAN CSVP Disintegrin and metalloproteinase domain-containing protein 17 (ADAM17) TNF-alpha convertase TNF-alpha-converting enzyme (TACE) Tumor necrosis factor-α converting enzyme (TACE)
Type:
Enzyme
Mol. Mass.:
93007.89
Organism:
Homo sapiens (Human)
Description:
Residue:
824
  
Inhibitor
Name:
BDBM114162
Synonyms:
3-[[(E)-cinnamyl]thio]-4-(2-furfuryl)-5-[(4-methylphenoxy)methyl]-1,2,4-triazole 4-(furan-2-ylmethyl)-3-[(4-methylphenoxy)methyl]-5-[(E)-3-phenylprop-2-enyl]sulfanyl-1,2,4-triazole SMR001835918 | cid_5961704
Type:
Small organic molecule
Emp. Form.:
C24H23N3O2S
Mol. Mass.:
417.523
SMILES:
Cc1ccc(OCc2nnc(SC\C=C\c3ccccc3)n2Cc2ccco2)cc1
: