Target
Protein artemis
Ligand
BDBM70611
Substrate
Meas. Tech.
Dose Response confirmation of small molecule inhibitors originally identified via uHTS of Artemis endonuclease activity via a fluorescence intensity assay
IC50
20000±n/a nM
Citation
 PubChem, PC Dose Response confirmation of small molecule inhibitors originally identified via uHTS of Artemis endonuclease activity via a fluorescence intensity assay PubChem Bioassay (2013)[AID] 
Target
Name:
Protein artemis
Synonyms:
ARTEMIS DCLRE1C SCIDA protein artemis isoform a
Type:
Enzyme Catalytic Domain
Mol. Mass.:
78427.91
Organism:
Homo sapiens (Human)
Description:
gi_76496497
Residue:
692
  
Inhibitor
Name:
BDBM70611
Synonyms:
4-[1-(4-bromophenyl)-2-nitro-ethyl]-5-methyl-2-phenyl-1H-pyrazol-3-one 4-[1-(4-bromophenyl)-2-nitroethyl]-5-methyl-2-phenyl-1H-pyrazol-3-one MLS000540808 cid_3575535
Type:
Small organic molecule
Emp. Form.:
C18H16BrN3O3
Mol. Mass.:
402.242
SMILES:
Cc1[nH]n(-c2ccccc2)c(=O)c1C(C[N+]([O-])=O)c1ccc(Br)cc1
: