Target
Nuclear hormone receptor family member daf-12
Ligand
BDBM49176
Substrate
Meas. Tech.
Luminescence-based cell-based high throughput dose response assay to identify agonists of the DAF-12 from the parasite H. contortus (hcDAF-12)
EC50
67527±n/a nM
Citation
 PubChem, PC Luminescence-based cell-based high throughput dose response assay to identify agonists of the DAF-12 from the parasite H. contortus (hcDAF-12) PubChem Bioassay (2013)[AID] 
Target
Name:
Nuclear hormone receptor family member daf-12
Synonyms:
DAF12_CAEEL XL285 daf-20 | mig-7
Type:
Enzyme Catalytic Domain
Mol. Mass.:
84211.49
Organism:
Caenorhabditis elegans
Description:
gi_71987181
Residue:
753
  
Inhibitor
Name:
BDBM49176
Synonyms:
(2E)-2-(3-methyl-1,3-benzothiazol-2-ylidene)-1-(2-thienyl)ethanone (2E)-2-(3-methyl-1,3-benzothiazol-2-ylidene)-1-thiophen-2-ylethanone MLS000072102 cid_1633229
Type:
Small organic molecule
Emp. Form.:
C14H11NOS2
Mol. Mass.:
273.373
SMILES:
CN1\C(Sc2ccccc12)=C/C(=O)c1cccs1
: