Target
Nuclear hormone receptor family member daf-12
Ligand
BDBM38855
Substrate
Meas. Tech.
Luminescence-based cell-based high throughput dose response assay to identify agonists of the DAF-12 from the parasite H. contortus (hcDAF-12)
EC50
67527±n/a nM
Citation
 PubChem, PC Luminescence-based cell-based high throughput dose response assay to identify agonists of the DAF-12 from the parasite H. contortus (hcDAF-12) PubChem Bioassay (2013)[AID] 
Target
Name:
Nuclear hormone receptor family member daf-12
Synonyms:
DAF12_CAEEL XL285 daf-20 | mig-7
Type:
Enzyme Catalytic Domain
Mol. Mass.:
84211.49
Organism:
Caenorhabditis elegans
Description:
gi_71987181
Residue:
753
  
Inhibitor
Name:
BDBM38855
Synonyms:
2-(2-furanyl)-3-methylbenzo[f]benzimidazole 2-(furan-2-yl)-3-methyl-benzo[f]benzimidazole 2-Furan-2-yl-1-methyl-1H-naphtho[2,3-d]imidazole SMR000014331 | cid_649492
Type:
Small organic molecule
Emp. Form.:
C16H12N2O
Mol. Mass.:
248.2793
SMILES:
Cn1c(nc2cc3ccccc3cc12)-c1ccco1
: