Target
Nuclear hormone receptor family member daf-12
Ligand
BDBM49185
Substrate
Meas. Tech.
Luminescence-based cell-based high throughput dose response assay to identify agonists of the DAF-12 from the parasite H. contortus (hcDAF-12)
EC50
67516±n/a nM
Citation
 PubChem, PC Luminescence-based cell-based high throughput dose response assay to identify agonists of the DAF-12 from the parasite H. contortus (hcDAF-12) PubChem Bioassay (2013)[AID] 
Target
Name:
Nuclear hormone receptor family member daf-12
Synonyms:
DAF12_CAEEL XL285 daf-20 | mig-7
Type:
Enzyme Catalytic Domain
Mol. Mass.:
84211.49
Organism:
Caenorhabditis elegans
Description:
gi_71987181
Residue:
753
  
Inhibitor
Name:
BDBM49185
Synonyms:
1-(3-Fluoro-phenyl)-3-(4-methyl-pyridin-2-yl)-urea 1-(3-fluorophenyl)-3-(4-methyl-2-pyridyl)urea MLS000034324 cid_653592
Type:
Small organic molecule
Emp. Form.:
C13H12FN3O
Mol. Mass.:
245.2523
SMILES:
Cc1ccnc(NC(=O)Nc2cccc(F)c2)c1
: