Target
Nuclear hormone receptor family member daf-12
Ligand
BDBM32227
Substrate
Meas. Tech.
Luminescence-based cell-based high throughput dose response assay to identify agonists of the DAF-12 from the parasite H. contortus (hcDAF-12)
EC50
67547±n/a nM
Citation
 PubChem, PC Luminescence-based cell-based high throughput dose response assay to identify agonists of the DAF-12 from the parasite H. contortus (hcDAF-12) PubChem Bioassay (2013)[AID] 
Target
Name:
Nuclear hormone receptor family member daf-12
Synonyms:
DAF12_CAEEL XL285 daf-20 | mig-7
Type:
Enzyme Catalytic Domain
Mol. Mass.:
84211.49
Organism:
Caenorhabditis elegans
Description:
gi_71987181
Residue:
753
  
Inhibitor
Name:
BDBM32227
Synonyms:
2-(1H-quinolin-2-ylidene)indane-1,3-quinone 2-(2-quinolyl)indane-1,3-quinone | cid_5355280
Type:
Small organic molecule
Emp. Form.:
C18H11NO2
Mol. Mass.:
273.2854
SMILES:
O=C1C(C(=O)c2ccccc12)c1ccc2ccccc2n1
: