Target
Nuclear hormone receptor family member daf-12
Ligand
BDBM49196
Substrate
Meas. Tech.
Luminescence-based cell-based high throughput dose response assay to identify agonists of the DAF-12 from the parasite H. contortus (hcDAF-12)
EC50
67541±n/a nM
Citation
 PubChem, PC Luminescence-based cell-based high throughput dose response assay to identify agonists of the DAF-12 from the parasite H. contortus (hcDAF-12) PubChem Bioassay (2013)[AID] 
Target
Name:
Nuclear hormone receptor family member daf-12
Synonyms:
DAF12_CAEEL XL285 daf-20 | mig-7
Type:
Enzyme Catalytic Domain
Mol. Mass.:
84211.49
Organism:
Caenorhabditis elegans
Description:
gi_71987181
Residue:
753
  
Inhibitor
Name:
BDBM49196
Synonyms:
7-methoxy-3-(4-methyl-1,3-thiazol-2-yl)chromen-4-one 7-methoxy-3-(4-methylthiazol-2-yl)chromone SMR000039004 | cid_658167
Type:
Small organic molecule
Emp. Form.:
C14H11NO3S
Mol. Mass.:
273.307
SMILES:
COc1ccc2c(c1)occ(-c1nc(C)cs1)c2=O
: