Target
Nuclear hormone receptor family member daf-12
Ligand
BDBM114715
Substrate
Meas. Tech.
Luminescence-based cell-based high throughput dose response assay to identify agonists of the DAF-12 from the parasite H. contortus (hcDAF-12)
EC50
67531±n/a nM
Citation
 PubChem, PC Luminescence-based cell-based high throughput dose response assay to identify agonists of the DAF-12 from the parasite H. contortus (hcDAF-12) PubChem Bioassay (2013)[AID] 
Target
Name:
Nuclear hormone receptor family member daf-12
Synonyms:
DAF12_CAEEL XL285 daf-20 | mig-7
Type:
Enzyme Catalytic Domain
Mol. Mass.:
84211.49
Organism:
Caenorhabditis elegans
Description:
gi_71987181
Residue:
753
  
Inhibitor
Name:
BDBM114715
Synonyms:
(4,6-dibromo-2-phenyl-1,3-benzoxazol-5-yl)amine 4,6-dibromo-2-phenyl-1,3-benzoxazol-5-amine SMR000035928 | cid_661662
Type:
Small organic molecule
Emp. Form.:
C13H8Br2N2O
Mol. Mass.:
368.023
SMILES:
Nc1c(Br)cc2oc(nc2c1Br)-c1ccccc1
: