Target
Nuclear hormone receptor family member daf-12
Ligand
BDBM49211
Substrate
Meas. Tech.
Luminescence-based cell-based high throughput dose response assay to identify agonists of the DAF-12 from the parasite H. contortus (hcDAF-12)
EC50
67532±n/a nM
Citation
 PubChem, PC Luminescence-based cell-based high throughput dose response assay to identify agonists of the DAF-12 from the parasite H. contortus (hcDAF-12) PubChem Bioassay (2013)[AID] 
Target
Name:
Nuclear hormone receptor family member daf-12
Synonyms:
DAF12_CAEEL XL285 daf-20 | mig-7
Type:
Enzyme Catalytic Domain
Mol. Mass.:
84211.49
Organism:
Caenorhabditis elegans
Description:
gi_71987181
Residue:
753
  
Inhibitor
Name:
BDBM49211
Synonyms:
(2-phenyl-1,3-thiazol-4-yl)methyl 3-methylthiophene-2-carboxylate 3-methylthiophene-2-carboxylic acid (2-phenylthiazol-4-yl)methyl ester SMR000062394 | cid_2997521
Type:
Small organic molecule
Emp. Form.:
C16H13NO2S2
Mol. Mass.:
315.41
SMILES:
Cc1ccsc1C(=O)OCc1csc(n1)-c1ccccc1
: