Target
Nuclear hormone receptor family member daf-12
Ligand
BDBM68461
Substrate
Meas. Tech.
Luminescence-based cell-based high throughput dose response assay to identify agonists of the DAF-12 from the parasite H. contortus (hcDAF-12)
EC50
67530±n/a nM
Citation
 PubChem, PC Luminescence-based cell-based high throughput dose response assay to identify agonists of the DAF-12 from the parasite H. contortus (hcDAF-12) PubChem Bioassay (2013)[AID] 
Target
Name:
Nuclear hormone receptor family member daf-12
Synonyms:
DAF12_CAEEL XL285 daf-20 | mig-7
Type:
Enzyme Catalytic Domain
Mol. Mass.:
84211.49
Organism:
Caenorhabditis elegans
Description:
gi_71987181
Residue:
753
  
Inhibitor
Name:
BDBM68461
Synonyms:
3-amino-2-(2-thienyl)-5,6,7,8-tetrahydrobenzothiopheno[2,3-d]pyrimidin-4-one 3-azanyl-2-thiophen-2-yl-5,6,7,8-tetrahydro-[1]benzothiolo[2,3-d]pyrimidin-4-one SMR000061127 | cid_943152
Type:
Small organic molecule
Emp. Form.:
C14H13N3OS2
Mol. Mass.:
303.403
SMILES:
Nn1c(nc2sc3CCCCc3c2c1=O)-c1cccs1
: