Target
Nuclear hormone receptor family member daf-12
Ligand
BDBM114716
Substrate
Meas. Tech.
Luminescence-based cell-based high throughput dose response assay to identify agonists of the DAF-12 from the parasite H. contortus (hcDAF-12)
EC50
67554±n/a nM
Citation
 PubChem, PC Luminescence-based cell-based high throughput dose response assay to identify agonists of the DAF-12 from the parasite H. contortus (hcDAF-12) PubChem Bioassay (2013)[AID] 
Target
Name:
Nuclear hormone receptor family member daf-12
Synonyms:
DAF12_CAEEL XL285 daf-20 | mig-7
Type:
Enzyme Catalytic Domain
Mol. Mass.:
84211.49
Organism:
Caenorhabditis elegans
Description:
gi_71987181
Residue:
753
  
Inhibitor
Name:
BDBM114716
Synonyms:
3-[2-[2,5-dimethyl-1-(2-thenyl)pyrrol-3-yl]-2-keto-ethyl]-1,2,3-benzotriazin-4-one 3-[2-[2,5-dimethyl-1-(thiophen-2-ylmethyl)pyrrol-3-yl]-2-oxidanylidene-ethyl]-1,2,3-benzotriazin-4-one MLS000081780 cid_2109648
Type:
Small organic molecule
Emp. Form.:
C20H18N4O2S
Mol. Mass.:
378.448
SMILES:
Cc1cc(C(=O)Cn2nnc3ccccc3c2=O)c(C)n1Cc1cccs1
: