Target
Nuclear hormone receptor family member daf-12
Ligand
BDBM49223
Substrate
Meas. Tech.
Luminescence-based cell-based high throughput dose response assay to identify agonists of the DAF-12 from the parasite H. contortus (hcDAF-12)
EC50
67541±n/a nM
Citation
 PubChem, PC Luminescence-based cell-based high throughput dose response assay to identify agonists of the DAF-12 from the parasite H. contortus (hcDAF-12) PubChem Bioassay (2013)[AID] 
Target
Name:
Nuclear hormone receptor family member daf-12
Synonyms:
DAF12_CAEEL XL285 daf-20 | mig-7
Type:
Enzyme Catalytic Domain
Mol. Mass.:
84211.49
Organism:
Caenorhabditis elegans
Description:
gi_71987181
Residue:
753
  
Inhibitor
Name:
BDBM49223
Synonyms:
2-(4-methoxyphenyl)-1-benzothiopyran-4-one MLS000055679 cid_2324877
Type:
Small organic molecule
Emp. Form.:
C16H12O2S
Mol. Mass.:
268.33
SMILES:
COc1ccc(cc1)-c1cc(=O)c2ccccc2s1
: