Target
Nuclear hormone receptor family member daf-12
Ligand
BDBM39099
Substrate
Meas. Tech.
Luminescence-based cell-based high throughput dose response assay to identify agonists of the DAF-12 from the parasite H. contortus (hcDAF-12)
EC50
67547±n/a nM
Citation
 PubChem, PC Luminescence-based cell-based high throughput dose response assay to identify agonists of the DAF-12 from the parasite H. contortus (hcDAF-12) PubChem Bioassay (2013)[AID] 
Target
Name:
Nuclear hormone receptor family member daf-12
Synonyms:
DAF12_CAEEL XL285 daf-20 | mig-7
Type:
Enzyme Catalytic Domain
Mol. Mass.:
84211.49
Organism:
Caenorhabditis elegans
Description:
gi_71987181
Residue:
753
  
Inhibitor
Name:
BDBM39099
Synonyms:
4H-3,1-benzothiazin-2-yl(p-tolyl)amine N-(4-methylphenyl)-4H-3,1-benzothiazin-2-amine cid_2999727
Type:
Small organic molecule
Emp. Form.:
C15H14N2S
Mol. Mass.:
254.35
SMILES:
Cc1ccc(cc1)N=C1Nc2ccccc2CS1
: