Target
Nuclear hormone receptor family member daf-12
Ligand
BDBM42723
Substrate
Meas. Tech.
Luminescence-based cell-based high throughput dose response assay to identify agonists of the DAF-12 from the parasite H. contortus (hcDAF-12)
EC50
67536±n/a nM
Citation
 PubChem, PC Luminescence-based cell-based high throughput dose response assay to identify agonists of the DAF-12 from the parasite H. contortus (hcDAF-12) PubChem Bioassay (2013)[AID] 
Target
Name:
Nuclear hormone receptor family member daf-12
Synonyms:
DAF12_CAEEL XL285 daf-20 | mig-7
Type:
Enzyme Catalytic Domain
Mol. Mass.:
84211.49
Organism:
Caenorhabditis elegans
Description:
gi_71987181
Residue:
753
  
Inhibitor
Name:
BDBM42723
Synonyms:
2-[(2-hydroxyanilino)methylene]indane-1,3-quinone 2-[[(2-hydroxyphenyl)amino]methylidene]indene-1,3-dione MLS000090106 cid_3241704
Type:
Small organic molecule
Emp. Form.:
C16H11NO3
Mol. Mass.:
265.2634
SMILES:
[#8]-c1ccccc1-[#7]\[#6]=[#6]-1/[#6](=O)-c2ccccc2-[#6]-1=O
: