Target
Nuclear hormone receptor family member daf-12
Ligand
BDBM114718
Substrate
Meas. Tech.
Luminescence-based cell-based high throughput dose response assay to identify agonists of the DAF-12 from the parasite H. contortus (hcDAF-12)
EC50
67536±n/a nM
Citation
 PubChem, PC Luminescence-based cell-based high throughput dose response assay to identify agonists of the DAF-12 from the parasite H. contortus (hcDAF-12) PubChem Bioassay (2013)[AID] 
Target
Name:
Nuclear hormone receptor family member daf-12
Synonyms:
DAF12_CAEEL XL285 daf-20 | mig-7
Type:
Enzyme Catalytic Domain
Mol. Mass.:
84211.49
Organism:
Caenorhabditis elegans
Description:
gi_71987181
Residue:
753
  
Inhibitor
Name:
BDBM114718
Synonyms:
2-[5-(1-naphthyl)-1,2,4-oxadiazol-3-yl]pyridine 5-(1-naphthyl)-3-(2-pyridyl)-1,2,4-oxadiazole MLS000099078 cid_757874
Type:
Small organic molecule
Emp. Form.:
C17H11N3O
Mol. Mass.:
273.2887
SMILES:
c1ccc(nc1)-c1noc(n1)-c1cccc2ccccc12
: