Target
Nuclear hormone receptor family member daf-12
Ligand
BDBM49255
Substrate
Meas. Tech.
Luminescence-based cell-based high throughput dose response assay to identify agonists of the DAF-12 from the parasite H. contortus (hcDAF-12)
EC50
67554±n/a nM
Citation
 PubChem, PC Luminescence-based cell-based high throughput dose response assay to identify agonists of the DAF-12 from the parasite H. contortus (hcDAF-12) PubChem Bioassay (2013)[AID] 
Target
Name:
Nuclear hormone receptor family member daf-12
Synonyms:
DAF12_CAEEL XL285 daf-20 | mig-7
Type:
Enzyme Catalytic Domain
Mol. Mass.:
84211.49
Organism:
Caenorhabditis elegans
Description:
gi_71987181
Residue:
753
  
Inhibitor
Name:
BDBM49255
Synonyms:
2-(4-fluorophenyl)-5H-[1,2,4]triazol[5,1-a]isoindole MLS000066641 cid_1236969
Type:
Small organic molecule
Emp. Form.:
C15H10FN3
Mol. Mass.:
251.2584
SMILES:
Fc1ccc(cc1)-c1nc2-c3ccccc3Cn2n1
: