Target
Nuclear hormone receptor family member daf-12
Ligand
BDBM93722
Substrate
Meas. Tech.
Luminescence-based cell-based high throughput dose response assay to identify agonists of the DAF-12 from the parasite H. contortus (hcDAF-12)
EC50
67538±n/a nM
Citation
 PubChem, PC Luminescence-based cell-based high throughput dose response assay to identify agonists of the DAF-12 from the parasite H. contortus (hcDAF-12) PubChem Bioassay (2013)[AID] 
Target
Name:
Nuclear hormone receptor family member daf-12
Synonyms:
DAF12_CAEEL XL285 daf-20 | mig-7
Type:
Enzyme Catalytic Domain
Mol. Mass.:
84211.49
Organism:
Caenorhabditis elegans
Description:
gi_71987181
Residue:
753
  
Inhibitor
Name:
BDBM93722
Synonyms:
(E)-3-(3-chloro-4-fluoro-anilino)-1-(2-furyl)prop-2-en-1-one (E)-3-(3-chloro-4-fluoroanilino)-1-(furan-2-yl)prop-2-en-1-one 3-[(3-chloro-4-fluorophenyl)amino]-1-(2-furyl)-2-propen-1-one SMR000074262 | cid_2196534
Type:
Small organic molecule
Emp. Form.:
C13H9ClFNO2
Mol. Mass.:
265.667
SMILES:
Fc1ccc(cc1Cl)N=CCC(=O)c1ccco1
: