Target
Nuclear hormone receptor family member daf-12
Ligand
BDBM39018
Substrate
Meas. Tech.
Luminescence-based cell-based high throughput dose response assay to identify agonists of the DAF-12 from the parasite H. contortus (hcDAF-12)
EC50
67525±n/a nM
Citation
 PubChem, PC Luminescence-based cell-based high throughput dose response assay to identify agonists of the DAF-12 from the parasite H. contortus (hcDAF-12) PubChem Bioassay (2013)[AID] 
Target
Name:
Nuclear hormone receptor family member daf-12
Synonyms:
DAF12_CAEEL XL285 daf-20 | mig-7
Type:
Enzyme Catalytic Domain
Mol. Mass.:
84211.49
Organism:
Caenorhabditis elegans
Description:
gi_71987181
Residue:
753
  
Inhibitor
Name:
BDBM39018
Synonyms:
2-(1,3-benzoxazol-2-yl)quinoline 2-(2-quinolyl)-1,3-benzoxazole MLS000059165 cid_723043
Type:
Small organic molecule
Emp. Form.:
C16H10N2O
Mol. Mass.:
246.2634
SMILES:
c1ccc2oc(nc2c1)-c1ccc2ccccc2n1
: