Target
Nuclear hormone receptor family member daf-12
Ligand
BDBM114719
Substrate
Meas. Tech.
Luminescence-based cell-based high throughput dose response assay to identify agonists of the DAF-12 from the parasite H. contortus (hcDAF-12)
EC50
67506±n/a nM
Citation
 PubChem, PC Luminescence-based cell-based high throughput dose response assay to identify agonists of the DAF-12 from the parasite H. contortus (hcDAF-12) PubChem Bioassay (2013)[AID] 
Target
Name:
Nuclear hormone receptor family member daf-12
Synonyms:
DAF12_CAEEL XL285 daf-20 | mig-7
Type:
Enzyme Catalytic Domain
Mol. Mass.:
84211.49
Organism:
Caenorhabditis elegans
Description:
gi_71987181
Residue:
753
  
Inhibitor
Name:
BDBM114719
Synonyms:
4-amino-6-methyl-2-phenyl-5-pyrimidinecarboxylic acid ethyl ester MLS000060918 cid_611239 ethyl 4-amino-6-methyl-2-phenylpyrimidine-5-carboxylate | ethyl 4-azanyl-6-methyl-2-phenyl-pyrimidine-5-carboxylate
Type:
Small organic molecule
Emp. Form.:
C14H15N3O2
Mol. Mass.:
257.2878
SMILES:
CCOC(=O)c1c(C)nc(nc1N)-c1ccccc1
: