Target
Nuclear hormone receptor family member daf-12
Ligand
BDBM49285
Substrate
Meas. Tech.
Luminescence-based cell-based high throughput dose response assay to identify agonists of the DAF-12 from the parasite H. contortus (hcDAF-12)
EC50
67536±n/a nM
Citation
 PubChem, PC Luminescence-based cell-based high throughput dose response assay to identify agonists of the DAF-12 from the parasite H. contortus (hcDAF-12) PubChem Bioassay (2013)[AID] 
Target
Name:
Nuclear hormone receptor family member daf-12
Synonyms:
DAF12_CAEEL XL285 daf-20 | mig-7
Type:
Enzyme Catalytic Domain
Mol. Mass.:
84211.49
Organism:
Caenorhabditis elegans
Description:
gi_71987181
Residue:
753
  
Inhibitor
Name:
BDBM49285
Synonyms:
5-(4-methylphenyl)-N-phenyl-1H-1,2,4-triazol-3-amine SMR000075700 phenyl-[5-(p-tolyl)-1H-1,2,4-triazol-3-yl]amine
Type:
Small organic molecule
Emp. Form.:
C15H14N4
Mol. Mass.:
250.2985
SMILES:
Cc1ccc(cc1)-c1nnc(Nc2ccccc2)[nH]1
: