Target
Nuclear hormone receptor family member daf-12
Ligand
BDBM49303
Substrate
Meas. Tech.
Luminescence-based cell-based high throughput dose response assay to identify agonists of the DAF-12 from the parasite H. contortus (hcDAF-12)
EC50
67541±n/a nM
Citation
 PubChem, PC Luminescence-based cell-based high throughput dose response assay to identify agonists of the DAF-12 from the parasite H. contortus (hcDAF-12) PubChem Bioassay (2013)[AID] 
Target
Name:
Nuclear hormone receptor family member daf-12
Synonyms:
DAF12_CAEEL XL285 daf-20 | mig-7
Type:
Enzyme Catalytic Domain
Mol. Mass.:
84211.49
Organism:
Caenorhabditis elegans
Description:
gi_71987181
Residue:
753
  
Inhibitor
Name:
BDBM49303
Synonyms:
2-[(5-chloranylthiophen-2-yl)carbonylamino]-4,5-dimethyl-thiophene-3-carboxamide 2-[(5-chlorothiophene-2-carbonyl)amino]-4,5-dimethylthiophene-3-carboxamide MLS000065679 SMR000080332 | cid_1245304
Type:
Small organic molecule
Emp. Form.:
C12H11ClN2O2S2
Mol. Mass.:
314.811
SMILES:
Cc1sc(NC(=O)c2ccc(Cl)s2)c(C(N)=O)c1C
: