Target
Nuclear hormone receptor family member daf-12
Ligand
BDBM50293102
Substrate
Meas. Tech.
Luminescence-based cell-based high throughput dose response assay to identify agonists of the DAF-12 from the parasite H. contortus (hcDAF-12)
EC50
67539±n/a nM
Citation
 PubChem, PC Luminescence-based cell-based high throughput dose response assay to identify agonists of the DAF-12 from the parasite H. contortus (hcDAF-12) PubChem Bioassay (2013)[AID] 
Target
Name:
Nuclear hormone receptor family member daf-12
Synonyms:
DAF12_CAEEL XL285 daf-20 | mig-7
Type:
Enzyme Catalytic Domain
Mol. Mass.:
84211.49
Organism:
Caenorhabditis elegans
Description:
gi_71987181
Residue:
753
  
Inhibitor
Name:
BDBM50293102
Synonyms:
5-(2-methoxyphenyl)-3-(pyridin-2-yl)-1,2,4-oxadiazole cid_912656
Type:
Small organic molecule
Emp. Form.:
C14H11N3O2
Mol. Mass.:
253.256
SMILES:
COc1ccccc1-c1nc(no1)-c1ccccn1
: