Target
Nuclear hormone receptor family member daf-12
Ligand
BDBM114720
Substrate
Meas. Tech.
Luminescence-based cell-based high throughput dose response assay to identify agonists of the DAF-12 from the parasite H. contortus (hcDAF-12)
EC50
67547±n/a nM
Citation
 PubChem, PC Luminescence-based cell-based high throughput dose response assay to identify agonists of the DAF-12 from the parasite H. contortus (hcDAF-12) PubChem Bioassay (2013)[AID] 
Target
Name:
Nuclear hormone receptor family member daf-12
Synonyms:
DAF12_CAEEL XL285 daf-20 | mig-7
Type:
Enzyme Catalytic Domain
Mol. Mass.:
84211.49
Organism:
Caenorhabditis elegans
Description:
gi_71987181
Residue:
753
  
Inhibitor
Name:
BDBM114720
Synonyms:
2-[(2-furanylmethylamino)methylidene]indene-1,3-dione 2-[(furan-2-ylmethylamino)methylidene]indene-1,3-dione SMR000104064 | cid_869136
Type:
Small organic molecule
Emp. Form.:
C15H11NO3
Mol. Mass.:
253.2527
SMILES:
O=[#6]-1\[#6](=[#6]\[#7]-[#6]-c2ccco2)-[#6](=O)-c2ccccc-12
: