Target
Nuclear hormone receptor family member daf-12
Ligand
BDBM48183
Substrate
Meas. Tech.
Luminescence-based cell-based high throughput dose response assay to identify agonists of the DAF-12 from the parasite H. contortus (hcDAF-12)
EC50
67541±n/a nM
Citation
 PubChem, PC Luminescence-based cell-based high throughput dose response assay to identify agonists of the DAF-12 from the parasite H. contortus (hcDAF-12) PubChem Bioassay (2013)[AID] 
Target
Name:
Nuclear hormone receptor family member daf-12
Synonyms:
DAF12_CAEEL XL285 daf-20 | mig-7
Type:
Enzyme Catalytic Domain
Mol. Mass.:
84211.49
Organism:
Caenorhabditis elegans
Description:
gi_71987181
Residue:
753
  
Inhibitor
Name:
BDBM48183
Synonyms:
5-(5-bromanylfuran-2-yl)-3-pyridin-2-yl-1,2,4-oxadiazole 5-(5-bromo-2-furyl)-3-(2-pyridyl)-1,2,4-oxadiazole MLS000114047 cid_752709
Type:
Small organic molecule
Emp. Form.:
C11H6BrN3O2
Mol. Mass.:
292.088
SMILES:
Brc1ccc(o1)-c1nc(no1)-c1ccccn1
: