Target
Nuclear hormone receptor family member daf-12
Ligand
BDBM48186
Substrate
Meas. Tech.
Luminescence-based cell-based high throughput dose response assay to identify agonists of the DAF-12 from the parasite H. contortus (hcDAF-12)
EC50
67541±n/a nM
Citation
 PubChem, PC Luminescence-based cell-based high throughput dose response assay to identify agonists of the DAF-12 from the parasite H. contortus (hcDAF-12) PubChem Bioassay (2013)[AID] 
Target
Name:
Nuclear hormone receptor family member daf-12
Synonyms:
DAF12_CAEEL XL285 daf-20 | mig-7
Type:
Enzyme Catalytic Domain
Mol. Mass.:
84211.49
Organism:
Caenorhabditis elegans
Description:
gi_71987181
Residue:
753
  
Inhibitor
Name:
BDBM48186
Synonyms:
5-methyl-2-(4-methylphenyl)-1,3-benzoxazole MLS000113249 cid_85307
Type:
Small organic molecule
Emp. Form.:
C15H13NO
Mol. Mass.:
223.2698
SMILES:
Cc1ccc(cc1)-c1nc2cc(C)ccc2o1
: