Target
Nuclear hormone receptor family member daf-12
Ligand
BDBM48192
Substrate
Meas. Tech.
Luminescence-based cell-based high throughput dose response assay to identify agonists of the DAF-12 from the parasite H. contortus (hcDAF-12)
EC50
67529±n/a nM
Citation
 PubChem, PC Luminescence-based cell-based high throughput dose response assay to identify agonists of the DAF-12 from the parasite H. contortus (hcDAF-12) PubChem Bioassay (2013)[AID] 
Target
Name:
Nuclear hormone receptor family member daf-12
Synonyms:
DAF12_CAEEL XL285 daf-20 | mig-7
Type:
Enzyme Catalytic Domain
Mol. Mass.:
84211.49
Organism:
Caenorhabditis elegans
Description:
gi_71987181
Residue:
753
  
Inhibitor
Name:
BDBM48192
Synonyms:
3-amino-4,6-dimethyl-N-(1,3-thiazol-2-yl)thieno[2,3-b]pyridine-2-carboxamide 3-amino-4,6-dimethyl-N-thiazol-2-yl-thieno[2,3-b]pyridine-2-carboxamide MLS000111537 cid_788673
Type:
Small organic molecule
Emp. Form.:
C13H12N4OS2
Mol. Mass.:
304.391
SMILES:
Cc1cc(C)c2c(N)c(sc2n1)C(=O)Nc1nccs1
: