Target
Nuclear hormone receptor family member daf-12
Ligand
BDBM49344
Substrate
Meas. Tech.
Luminescence-based cell-based high throughput dose response assay to identify agonists of the DAF-12 from the parasite H. contortus (hcDAF-12)
EC50
67526±n/a nM
Citation
 PubChem, PC Luminescence-based cell-based high throughput dose response assay to identify agonists of the DAF-12 from the parasite H. contortus (hcDAF-12) PubChem Bioassay (2013)[AID] 
Target
Name:
Nuclear hormone receptor family member daf-12
Synonyms:
DAF12_CAEEL XL285 daf-20 | mig-7
Type:
Enzyme Catalytic Domain
Mol. Mass.:
84211.49
Organism:
Caenorhabditis elegans
Description:
gi_71987181
Residue:
753
  
Inhibitor
Name:
BDBM49344
Synonyms:
2-(2-chloranylphenoxy)-N-(5-chloranylpyridin-2-yl)ethanamide 2-(2-chlorophenoxy)-N-(5-chloro-2-pyridyl)acetamide MLS000110802 cid_883796
Type:
Small organic molecule
Emp. Form.:
C13H10Cl2N2O2
Mol. Mass.:
297.137
SMILES:
Clc1ccc(NC(=O)COc2ccccc2Cl)nc1
: