Target
Nuclear hormone receptor family member daf-12
Ligand
BDBM51686
Substrate
Meas. Tech.
Luminescence-based cell-based high throughput dose response assay to identify agonists of the DAF-12 from the parasite H. contortus (hcDAF-12)
EC50
67541±n/a nM
Citation
 PubChem, PC Luminescence-based cell-based high throughput dose response assay to identify agonists of the DAF-12 from the parasite H. contortus (hcDAF-12) PubChem Bioassay (2013)[AID] 
Target
Name:
Nuclear hormone receptor family member daf-12
Synonyms:
DAF12_CAEEL XL285 daf-20 | mig-7
Type:
Enzyme Catalytic Domain
Mol. Mass.:
84211.49
Organism:
Caenorhabditis elegans
Description:
gi_71987181
Residue:
753
  
Inhibitor
Name:
BDBM51686
Synonyms:
1-(Quinolin-3-ylaminomethyl)-naphthalen-2-ol 1-[(3-quinolylamino)methyl]-2-naphthol MLS000067462 cid_951184
Type:
Small organic molecule
Emp. Form.:
C20H16N2O
Mol. Mass.:
300.3538
SMILES:
Oc1ccc2ccccc2c1CNc1cnc2ccccc2c1
: