Target
Nuclear hormone receptor family member daf-12
Ligand
BDBM40552
Substrate
Meas. Tech.
Luminescence-based cell-based high throughput dose response assay to identify agonists of the DAF-12 from the parasite H. contortus (hcDAF-12)
EC50
67568±n/a nM
Citation
 PubChem, PC Luminescence-based cell-based high throughput dose response assay to identify agonists of the DAF-12 from the parasite H. contortus (hcDAF-12) PubChem Bioassay (2013)[AID] 
Target
Name:
Nuclear hormone receptor family member daf-12
Synonyms:
DAF12_CAEEL XL285 daf-20 | mig-7
Type:
Enzyme Catalytic Domain
Mol. Mass.:
84211.49
Organism:
Caenorhabditis elegans
Description:
gi_71987181
Residue:
753
  
Inhibitor
Name:
BDBM40552
Synonyms:
2-(7-Methyl-quinolin-2-yl)-indan-1,3-dione 2-(7-methyl-2-quinolyl)indane-1,3-quinone MLS000526211 cid_2843949
Type:
Small organic molecule
Emp. Form.:
C19H13NO2
Mol. Mass.:
287.312
SMILES:
Cc1ccc2ccc(nc2c1)C1C(=O)c2ccccc2C1=O
: