Target
Nuclear hormone receptor family member daf-12
Ligand
BDBM34668
Substrate
Meas. Tech.
Luminescence-based cell-based high throughput dose response assay to identify agonists of the DAF-12 from the parasite H. contortus (hcDAF-12)
EC50
67547±n/a nM
Citation
 PubChem, PC Luminescence-based cell-based high throughput dose response assay to identify agonists of the DAF-12 from the parasite H. contortus (hcDAF-12) PubChem Bioassay (2013)[AID] 
Target
Name:
Nuclear hormone receptor family member daf-12
Synonyms:
DAF12_CAEEL XL285 daf-20 | mig-7
Type:
Enzyme Catalytic Domain
Mol. Mass.:
84211.49
Organism:
Caenorhabditis elegans
Description:
gi_71987181
Residue:
753
  
Inhibitor
Name:
BDBM34668
Synonyms:
6-Methyl-2-p-tolyl-2H-benzotriazol-5-ylamine 6-methyl-2-(4-methylphenyl)benzotriazol-5-amine SMR000117323 cid_736271
Type:
Small organic molecule
Emp. Form.:
C14H14N4
Mol. Mass.:
238.2878
SMILES:
Cc1ccc(cc1)-n1nc2cc(C)c(N)cc2n1
: