Target
Nuclear hormone receptor family member daf-12
Ligand
BDBM49376
Substrate
Meas. Tech.
Luminescence-based cell-based high throughput dose response assay to identify agonists of the DAF-12 from the parasite H. contortus (hcDAF-12)
EC50
67530±n/a nM
Citation
 PubChem, PC Luminescence-based cell-based high throughput dose response assay to identify agonists of the DAF-12 from the parasite H. contortus (hcDAF-12) PubChem Bioassay (2013)[AID] 
Target
Name:
Nuclear hormone receptor family member daf-12
Synonyms:
DAF12_CAEEL XL285 daf-20 | mig-7
Type:
Enzyme Catalytic Domain
Mol. Mass.:
84211.49
Organism:
Caenorhabditis elegans
Description:
gi_71987181
Residue:
753
  
Inhibitor
Name:
BDBM49376
Synonyms:
(6-Methyl-pyridin-2-yl)-(4-thiophen-2-yl-thiazol-2-yl)-amine MLS000527802 N-(6-methylpyridin-2-yl)-4-thiophen-2-yl-1,3-thiazol-2-amine cid_973018
Type:
Small organic molecule
Emp. Form.:
C13H11N3S2
Mol. Mass.:
273.377
SMILES:
Cc1cccc(Nc2nc(cs2)-c2cccs2)n1
: