Target
Nuclear hormone receptor family member daf-12
Ligand
BDBM50293103
Substrate
Meas. Tech.
Luminescence-based cell-based high throughput dose response assay to identify activators of the DAF-12 from the parasite S. stercoralis (ssDAF-12)
IC50
67541±n/a nM
Citation
 PubChem, PC Luminescence-based cell-based high throughput dose response assay to identify activators of the DAF-12 from the parasite S. stercoralis (ssDAF-12) PubChem Bioassay (2013)[AID] 
Target
Name:
Nuclear hormone receptor family member daf-12
Synonyms:
DAF12_CAEEL XL285 daf-20 | mig-7
Type:
Enzyme Catalytic Domain
Mol. Mass.:
84211.49
Organism:
Caenorhabditis elegans
Description:
gi_71987181
Residue:
753
  
Inhibitor
Name:
BDBM50293103
Synonyms:
5-(2-fluorophenyl)-3-(4-methoxyphenyl)-1,2,4-oxadiazole cid_925735
Type:
Small organic molecule
Emp. Form.:
C15H11FN2O2
Mol. Mass.:
270.2584
SMILES:
COc1ccc(cc1)-c1noc(n1)-c1ccccc1F
: