Target
Nuclear hormone receptor family member daf-12
Ligand
BDBM40551
Substrate
Meas. Tech.
Luminescence-based cell-based high throughput dose response assay to identify activators of the DAF-12 from the parasite S. stercoralis (ssDAF-12)
IC50
67541±n/a nM
Citation
 PubChem, PC Luminescence-based cell-based high throughput dose response assay to identify activators of the DAF-12 from the parasite S. stercoralis (ssDAF-12) PubChem Bioassay (2013)[AID] 
Target
Name:
Nuclear hormone receptor family member daf-12
Synonyms:
DAF12_CAEEL XL285 daf-20 | mig-7
Type:
Enzyme Catalytic Domain
Mol. Mass.:
84211.49
Organism:
Caenorhabditis elegans
Description:
gi_71987181
Residue:
753
  
Inhibitor
Name:
BDBM40551
Synonyms:
2-(1H-quinolin-4-ylidene)indane-1,3-quinone 2-(4-quinolyl)indane-1,3-quinone MLS000122777 cid_5765327
Type:
Small organic molecule
Emp. Form.:
C18H11NO2
Mol. Mass.:
273.2854
SMILES:
O=C1C(C(=O)c2ccccc12)c1ccnc2ccccc12
: