Target
Nuclear hormone receptor family member daf-12
Ligand
BDBM114864
Substrate
Meas. Tech.
Luminescence-based cell-based high throughput dose response assay to identify activators of the DAF-12 from the parasite S. stercoralis (ssDAF-12)
IC50
67541±n/a nM
Citation
 PubChem, PC Luminescence-based cell-based high throughput dose response assay to identify activators of the DAF-12 from the parasite S. stercoralis (ssDAF-12) PubChem Bioassay (2013)[AID] 
Target
Name:
Nuclear hormone receptor family member daf-12
Synonyms:
DAF12_CAEEL XL285 daf-20 | mig-7
Type:
Enzyme Catalytic Domain
Mol. Mass.:
84211.49
Organism:
Caenorhabditis elegans
Description:
gi_71987181
Residue:
753
  
Inhibitor
Name:
BDBM114864
Synonyms:
MLS000334394 N-(6-amino-1-benzyl-2,4-dioxopyrimidin-5-yl)-N-butyl-2-(7-methoxy-4-methylquinolin-2-yl)sulfanylacetamide N-[6-azanyl-2,4-bis(oxidanylidene)-1-(phenylmethyl)pyrimidin-5-yl]-N-butyl-2-(7-methoxy-4-methyl-quinolin-2-yl)sulfanyl-ethanamide cid_2483322
Type:
Small organic molecule
Emp. Form.:
C28H31N5O4S
Mol. Mass.:
533.642
SMILES:
CCCCN(C(=O)CSc1cc(C)c2ccc(OC)cc2n1)c1c(N)n(Cc2ccccc2)c(=O)[nH]c1=O
: