Target
Oxysterols receptor LXR-beta
Ligand
BDBM114745
Substrate
Meas. Tech.
Counterscreen for agonists of the daf-12 abnormal Dauer Formation: Luminescence-based cell-based dose response assay to identify agonists of the Liver-X-Receptor (LXR).
EC50
67535±n/a nM
Citation
 PubChem, PC Counterscreen for agonists of the daf-12 abnormal Dauer Formation: Luminescence-based cell-based dose response assay to identify agonists of the Liver-X-Receptor (LXR). PubChem Bioassay (2013)[AID] 
Target
Name:
Oxysterols receptor LXR-beta
Synonyms:
LXRB Liver X, LXR beta NR1H2 Nuclear receptor NER Ubiquitously-expressed nuclear receptor
Type:
Enzyme Catalytic Domain
Mol. Mass.:
50978.79
Organism:
Homo sapiens (Human)
Description:
P55055
Residue:
460
  
Inhibitor
Name:
BDBM114745
Synonyms:
2-(dichloromethyl)-4-(4-methylphenyl)-3H-1,5-benzodiazepine 4-(dichloromethyl)-2-(p-tolyl)-3H-1,5-benzodiazepine MLS000728204 cid_685576
Type:
Small organic molecule
Emp. Form.:
C17H14Cl2N2
Mol. Mass.:
317.212
SMILES:
Cc1ccc(cc1)C1=Nc2ccccc2N=C(C1)C(Cl)Cl
: