Target
Oxysterols receptor LXR-beta
Ligand
BDBM48184
Substrate
Meas. Tech.
Counterscreen for agonists of the daf-12 abnormal Dauer Formation: Luminescence-based cell-based dose response screening assay to identify agonists of the Liver-X-Receptor (LXR)
EC50
67537±n/a nM
Citation
 PubChem, PC Counterscreen for agonists of the daf-12 abnormal Dauer Formation: Luminescence-based cell-based dose response screening assay to identify agonists of the Liver-X-Receptor (LXR) PubChem Bioassay (2013)[AID] 
Target
Name:
Oxysterols receptor LXR-beta
Synonyms:
LXRB Liver X, LXR beta NR1H2 Nuclear receptor NER Ubiquitously-expressed nuclear receptor
Type:
Enzyme Catalytic Domain
Mol. Mass.:
50978.79
Organism:
Homo sapiens (Human)
Description:
P55055
Residue:
460
  
Inhibitor
Name:
BDBM48184
Synonyms:
2-(3-chlorophenyl)-5-phenyl-1,3,4-oxadiazole MLS000108072 cid_259755
Type:
Small organic molecule
Emp. Form.:
C14H9ClN2O
Mol. Mass.:
256.687
SMILES:
Clc1cccc(c1)-c1nnc(o1)-c1ccccc1
: