Target
Oxysterols receptor LXR-beta
Ligand
BDBM115067
Substrate
Meas. Tech.
Counterscreen for agonists of the daf-12 abnormal Dauer Formation: Luminescence-based cell-based dose response screening assay to identify agonists of the Liver-X-Receptor (LXR)
EC50
67554±n/a nM
Citation
 PubChem, PC Counterscreen for agonists of the daf-12 abnormal Dauer Formation: Luminescence-based cell-based dose response screening assay to identify agonists of the Liver-X-Receptor (LXR) PubChem Bioassay (2013)[AID] 
Target
Name:
Oxysterols receptor LXR-beta
Synonyms:
LXRB Liver X, LXR beta NR1H2 Nuclear receptor NER Ubiquitously-expressed nuclear receptor
Type:
Enzyme Catalytic Domain
Mol. Mass.:
50978.79
Organism:
Homo sapiens (Human)
Description:
P55055
Residue:
460
  
Inhibitor
Name:
BDBM115067
Synonyms:
5-bromanyl-N-naphthalen-2-yl-furan-2-carboxamide 5-bromo-N-(2-naphthyl)-2-furamide MLS001123663 cid_765392
Type:
Small organic molecule
Emp. Form.:
C15H10BrNO2
Mol. Mass.:
316.149
SMILES:
Brc1ccc(o1)C(=O)Nc1ccc2ccccc2c1
: