Target
Oxysterols receptor LXR-beta
Ligand
BDBM50293103
Substrate
Meas. Tech.
Counterscreen for agonists of the daf-12 abnormal Dauer Formation: Luminescence-based cell-based screening assay to identify agonists of the Liver-X-Receptor (LXR).
IC50
67541±n/a nM
Citation
 PubChem, PC Counterscreen for agonists of the daf-12 abnormal Dauer Formation: Luminescence-based cell-based screening assay to identify agonists of the Liver-X-Receptor (LXR). PubChem Bioassay (2013)[AID] 
Target
Name:
Oxysterols receptor LXR-beta
Synonyms:
LXRB Liver X, LXR beta NR1H2 Nuclear receptor NER Ubiquitously-expressed nuclear receptor
Type:
Enzyme Catalytic Domain
Mol. Mass.:
50978.79
Organism:
Homo sapiens (Human)
Description:
P55055
Residue:
460
  
Inhibitor
Name:
BDBM50293103
Synonyms:
5-(2-fluorophenyl)-3-(4-methoxyphenyl)-1,2,4-oxadiazole cid_925735
Type:
Small organic molecule
Emp. Form.:
C15H11FN2O2
Mol. Mass.:
270.2584
SMILES:
COc1ccc(cc1)-c1noc(n1)-c1ccccc1F
: