Target
Oxysterols receptor LXR-beta
Ligand
BDBM49574
Substrate
Meas. Tech.
Counterscreen for agonists of the daf-12 abnormal Dauer Formation: Luminescence-based cell-based screening assay to identify agonists of the Liver-X-Receptor (LXR).
IC50
67537±n/a nM
Citation
 PubChem, PC Counterscreen for agonists of the daf-12 abnormal Dauer Formation: Luminescence-based cell-based screening assay to identify agonists of the Liver-X-Receptor (LXR). PubChem Bioassay (2013)[AID] 
Target
Name:
Oxysterols receptor LXR-beta
Synonyms:
LXRB Liver X, LXR beta NR1H2 Nuclear receptor NER Ubiquitously-expressed nuclear receptor
Type:
Enzyme Catalytic Domain
Mol. Mass.:
50978.79
Organism:
Homo sapiens (Human)
Description:
P55055
Residue:
460
  
Inhibitor
Name:
BDBM49574
Synonyms:
(Z)-2-(1,3-benzothiazol-2-yl)-3-(2-furanyl)-2-propenenitrile (Z)-2-(1,3-benzothiazol-2-yl)-3-(furan-2-yl)prop-2-enenitrile MLS000589637 cid_7441600
Type:
Small organic molecule
Emp. Form.:
C14H8N2OS
Mol. Mass.:
252.291
SMILES:
N#C\C(=C\c1ccco1)c1nc2ccccc2s1
: